{"text_format":"1","workbook":"xlsx","n_sheets":6,"sheets":["Approval and Funding","Position Justification Form","Position Description","MEMO","Sheet1","Sheet2"],"not_rendered":{"charts":0,"images":2,"macros":1,"external_links":0,"defined_names":64,"comments":2,"pivot_tables":0},"unopened":[],"bounds":{"document_bytes":16777216,"sheet_cells":100000,"rows_first":2000,"rows_last":500,"rows_between":2000,"halvings":0,"cell_chars":16384,"cell_head_chars":4096},"cells_cut":0,"cells_raw":0,"read":"whole","date_system":"1900"}

{"sheet":"Approval and Funding","index":0,"n_rows":64,"n_cols":13,"rows_kept":64,"cut":false,"hidden":false,"merged":[[4,11,4,13],[13,3,13,10],[30,8,30,9],[30,13,33,13],[21,6,21,10],[17,6,17,10],[18,6,18,10],[19,6,19,10],[20,6,20,10],[23,1,23,12],[18,4,18,5],[20,4,20,5],[5,4,5,10],[8,4,8,10],[9,4,9,11],[10,4,10,10],[65,5,65,6],[39,1,40,3],[30,10,30,11],[36,8,36,13],[37,7,37,11],[39,7,40,7],[31,8,31,9],[32,8,32,9],[31,10,31,11],[32,10,32,11],[30,12,33,12],[39,8,40,8],[30,1,30,2],[31,1,31,2],[59,5,59,11],[60,5,60,11],[15,6,15,10],[16,6,16,10],[15,4,15,5],[16,4,16,5],[61,1,61,11],[55,1,55,4],[52,1,52,4],[53,1,53,4],[54,1,54,4],[52,5,52,11],[53,5,53,11],[60,1,60,4],[56,1,56,4],[57,1,57,4],[58,1,58,4],[25,4,25,5],[26,4,26,5],[36,1,36,4],[59,1,59,4],[50,1,50,4],[50,5,50,11],[41,5,41,6],[42,5,42,6],[43,5,43,6],[44,5,44,6],[45,3,45,6],[41,1,41,3],[42,1,42,3],[43,1,43,3],[44,1,44,3],[28,1,28,12],[34,1,34,12],[39,12,40,12],[39,9,40,9],[39,10,40,10],[39,11,40,11],[39,4,40,4],[39,5,40,6],[37,5,37,6],[47,1,48,4],[49,1,49,4],[47,5,48,11],[49,5,49,11],[51,1,51,4],[51,5,51,11],[63,1,63,11],[64,1,64,11],[6,3,6,10],[25,1,25,3],[26,1,26,3],[30,3,30,4],[31,3,31,4],[54,5,54,11],[55,5,55,11],[56,5,56,11],[57,5,57,11],[58,5,58,11],[37,1,37,4],[36,5,36,6]]}
[null,null,null,null," "]
[null,null,null,null," "]
[null,null,null,null," "]
[null,null,null,null," "]
[null,null,null,null," ",null,null,null,null,null,null,"Form Date 11/13/2018"]
[]
[null,null,null,"STAFF POSITION MANAGEMENT FORM"]
[]
[null,null,null,null,"*MAKE SURE MACROS ARE ENABLED*"]
[null,null,null,null,"           Please ensure tabs are complete before submitting.  Only completed forms will be processed. "]
[null,null,null,null," Incomplete forms will be returned to Business Managers."]
[]
[]
[null,null,null,"Approval and Funding"]
[null,null,null,"*For new and repurposed positions, you must fill out the Position Justification Form as well"]
[null,null,null,null,"Type",null,"Definition"]
[null,null,null,null,"New Position",null,"Creation of a position resulting in additional headcount to a division."]
[]
[null,null,null,null,"Replacement",null,"A replacement occurs when a position is vacated and subsequently filled with no change to any of the position attributes (i.e. no changes to family, sub-family, level, career stream)"]
[]
[null,null,null,null,"Repurpose",null,"Any instance where a position attribute changes (i.e. family, sub-family, level, career stream). "]
[]
[null,null,null,null," "]
[null,"1.   Has This Position Been Reviewed/Approved by the Appropriate Senior Leadership? (Dean/VP/ETC.)"]
[null,"*Remember to copy the leader in the box below on your email submission"]
[null,"Leader's Name:"]
[null,"Date Approved:"]
[]
[null,"2.   Position Information"]
[]
[null,"Weeks/Year:",null,null,null,null,null,null,"Type of Position:",null,"- click box -"]
[null,"Hours/Week:",null,null,null,null,null,null,"Limited Term End Date: "]
[null,null,null,null,null,null,null,null,"Limited Term Length:"]
[]
[null,"3.   Funding Labor Distribution and Amount / Notes"]
[]
[null,"Position Budget Org:"]
[null,"Estimated Annual Salary:"]
[]
[null,"Labor Distribution Lines",null,null,"Fund","Organization",null,"Program ","Activity (optional)","Funding Source Type *","Amount","Percentage","Primary Source?"]
[]
[null,"Distribution 1",null,null,null,null,null,null,null," - Click Box",null,{"$f":"IF(ISERROR(K42/$K$46),0,K42/$K$46)","v":0}]
[null,"Distribution 2",null,null,null,null,null,null,null," - Click Box",null,{"$f":"IF(ISERROR(K43/$K$46),0,K43/$K$46)","v":0}]
[null,"Distribution 3",null,null,null,null,null,null,null," - Click Box",null,{"$f":"IF(ISERROR(K44/$K$46),0,K44/$K$46)","v":0}]
[null,"Distribution 4",null,null,null,null,null,null,null," - Click Box",null,{"$f":"IF(ISERROR(K45/$K$46),0,K45/$K$46)","v":0}]
[null,null,null,null,null,null,null,null,null,"TOTAL",{"$f":"SUM(K42:K45)","v":0},{"$f":"SUM(L42:L45)","v":0}]
[]
[null,"Funding Source Type",null,null,null,"Definitions & Examples"]
[]
[null,"OPB: Operating Budget E&G",null,null,null,"University Operating budget funds; Fund 100000-XXXXX-XXXXX"]
[null,"AUX: Auxiliary Net Revenue",null,null,null,"Funding from auxiliary unit net revenue; 100000 < Fund < 199999"]
[null,"AOV: Advancing our Vision",null,null,null,"Funding of hiring plan established with AOV funds"]
[null,"ONE: One-Time Funding",null,null,null,"Funding from non-recurring source, such as bridge funds from Exec. Officer, unit incentive funds, etc."]
[null,"END: Endowment Income",null,null,null,"Funded by quarterly endowment payout income"]
[null,"EXP: Expendable Gifts",null,null,null,"Funded by annual gifts not included in the endowment pool"]
[null,"REV: Program Revenue",null,null,null,"Funded by revenues or fees generated by the program (i.e.graduate tuition, ACE programming, etc.)"]
[null,"G&C: Grants & Contracts",null,null,null,"Funded by external grants or contracts; Fund 2XXXXX"]
[null,"RCH: Research - Recharge/Cores",null,null,null,"Research funding generated by recharge revenues charged to external or internal parties; Fund 390XXX"]
[null,"F&A: Research - F&A",null,null,null,"Research funding generated by F&A returns to the University"]
[null,"SAPC: Research - SAPC",null,null,null,"Research funding generated by University SAPC funding; Fund 309XXX"]
[null,"OTH: Other (Explain Below)",null,null,null,"Please explain alternative funding source below, including whether funding is recurring or one-time"]
[null,"*If unsure of which option to select, please contact the Budget Office for further consultation"]
[]
[null,"Please enter any additional information that you believe will be helpful in explaining the funding answers given above:"]

{"sheet":"Position Justification Form","index":1,"n_rows":39,"n_cols":6,"rows_kept":39,"cut":false,"hidden":false,"merged":[[82,1,87,4],[40,1,45,5],[38,1,39,5],[4,5,4,6],[31,1,36,5],[20,1,25,5],[19,1,19,5],[11,1,16,5],[10,1,10,5],[6,1,6,5],[8,1,8,5],[29,1,30,5],[7,1,7,5]]}
[null,null,null," "]
[null,null,null," "]
[null,null,null," "]
[null,null,null," "]
[null,null,null," ",null,"Form Date 11/13/2018"]
[]
[null,"NEW Position Justification Form"]
[null,"*For New and Repurposed Positions"]
[null,"Position Justification"]
[]
[null,"Why is this position/change necessary?"]
[]
[]
[]
[]
[]
[]
[]
[]
[null,"How were the duties for this position accomplished previously? "]
[]
[]
[]
[]
[]
[]
[]
[]
[]
[null,"What alternatives have you considered to creating this position? (i.e. restructure, redistribution of work)"]
[]
[]
[]
[]
[]
[]
[]
[]
[null,"If approval cannot be granted, how will the work be accomplished without increasing salary expense? "]

{"sheet":"Position Description","index":2,"n_rows":128,"n_cols":5,"rows_kept":128,"cut":false,"hidden":false,"merged":[[34,1,34,3],[38,1,38,4],[41,1,41,4],[119,1,119,4],[118,1,118,4],[111,1,111,4],[92,2,93,2],[92,1,93,1],[55,1,55,4],[59,1,59,4],[116,1,116,4],[60,1,60,4],[68,1,68,3],[65,1,65,4],[66,1,66,4],[63,1,63,4],[126,2,126,4],[127,2,127,4],[66,5,67,5],[123,5,125,5],[119,5,120,5],[125,2,125,4],[123,2,123,4],[124,2,124,4],[81,1,81,2],[86,1,86,2],[91,3,91,4],[91,1,91,2],[99,1,99,2],[113,1,113,4],[114,1,114,4],[121,1,121,4],[42,5,43,5],[45,5,46,5],[58,5,59,5],[53,1,53,2],[53,3,53,4],[46,1,46,4],[47,1,47,2],[49,1,49,2],[49,3,49,4],[47,3,47,4],[58,1,58,4],[57,1,57,4],[56,1,56,4],[45,1,45,4],[61,1,61,4],[54,1,54,4],[52,1,52,2],[52,3,52,4],[50,3,50,4],[51,1,51,2],[51,3,51,4],[40,1,40,4],[35,1,35,3],[36,1,36,3],[50,1,50,2],[42,1,42,4],[44,1,44,4],[48,3,48,4],[43,1,43,4],[48,1,48,2],[37,1,37,2],[39,1,39,4],[27,1,27,4],[5,1,5,4],[25,1,25,4],[22,3,23,3],[22,4,23,4],[26,1,26,4],[22,1,23,1],[24,1,24,4],[10,1,11,4],[8,1,8,4],[9,1,9,4],[21,2,23,2],[4,4,4,6],[32,1,32,3],[33,1,33,3],[6,1,6,4],[22,5,25,5],[31,1,31,3],[30,1,30,3],[28,1,28,3],[29,1,29,3]]}
[null,null,null," "]
[null,null,null," "]
[null,null,null," "]
[null,null,null," "]
[null,null,null," ","Form Date 11/13/2018"]
[]
[null,"STAFF POSITION MANAGEMENT FORM"]
[]
[null,"                     Please ensure tabs are complete before submitting.  Only completed forms will be processed. "]
[null," Incomplete forms will be returned to Business Managers."]
[null,"POSITION DESCRIPTION"]
[]
[null,"Existing Position Number"]
[null,"Last Incumbent Name",null,"*Can be found in the Vacant Single Positions Report"]
[null,"Last Fill Date",null,"*Inside.nd.edu - Jobs and Position Report"]
[]
[null,"Key Contact:",null,"Phone #:"]
[null,"Employing Org #:",null,"Employing Org Name:"]
[null,"Hiring Manager:"]
[]
[null,"Proposed Working Title:",null,"Supervisor Name:"]
[null,"Comparable Positions:",null,"Supervisor's Working Title:"]
[null,null,null,"Supervisor's Career Stream and Level:"," - click box for dropdown arrow -"]
[]
[]
[null,"POSITION SUMMARY STATEMENT:  (type text below)"]
[]
[]
[null,"ESSENTIAL DUTIES AND RESPONSIBILITIES: (in descending order of time spent)",null,null,"% of Time"]
["1. "]
["2. "]
["3. "]
["4. "]
["5. "]
["6. "]
["7. "]
["8. "]
[null,"     ",null,"Total of all percentages            should equal 100%",{"$f":"SUM(E30:E37)","v":0}]
[]
[null,"PROBLEM SOLVING:  "]
[]
[null,"Choose the statement that best describes the type of problem solving the position is routinely responsible for:"]
[null," - click box for dropdown arrow -"]
[]
[null," Choose the statement that best describes the impact of the typical actions or decisions made in this job:"]
[null," - click box for dropdown arrow -"]
[]
[null,"Please provide an explanation of decisions made:",null,"Please provide an explanation of the impact of decisions made:"]
[null,"Example:   Increase the number of incoming freshman",null,"Impacts the number of faculty, housing capability, number of courses offered"]
[]
[]
[]
[]
[]
[]
[null,"POLICY DEVELOPMENT AND CHANGE:"]
[]
[null,"Choose the statement that best describes the level of policy and development and change responsibility in this job:"]
[null," - click box for dropdown arrow -"]
[]
[null,"Provide an example of this position's policy development and change responsibilities:     (type text below)"]
[]
[]
[null,"REPORTING RELATIONSHIPS:"]
[]
[null,"Choose the statement that best characterizes the position's responsibilities for providing functional guidance or direct supervision over others:"]
[null," - click box for dropdown arrow -"]
[]
[null,"If the position has responsibility for supervision, please fill out the following:"]
[null,null,"Direct Reports (# of employees reporting directly to position)","Indirect Reports(# of employees reporting to the direct reports)"]
[null,"EIC Employees"]
[null,"NIC Employees"]
[null,"Mgmt Employees"]
[null,"Contract Employees"]
[null,"Temporary Employees"]
[null,"Seasonal Employees"]
[null,"Student Employees"]
[]
[]
[null,"ORGANIZATION CHART:"]
[]
[null,"   Supervisor's Supervisor"]
[null,"Name:"]
[null,"Working Title:"]
[]
[]
[null," Supervisor"]
[null,"Name:"]
[null,"Working Title:"]
[]
[]
[null,"  This Position",null,"  Other Titles Reporting To Supervisor"]
[null,"Working Title:",null,"A.  Name:"]
[null,null,null,"A. Working Title:"]
[null,null,null,"B. Name:"]
[null,null,null,"B. Working Title:"]
[null,null,null,"C. Name:"]
[null,null,null,"C. Working Title:"]
[]
[null,"   Direct Reports To This Position"]
[null,"A.  Name:"]
[null,"A. Working Title:"]
[null,"B. Name:"]
[null,"B. Working Title:"]
[null,"C. Name:"]
[null,"C. Working Title:"]
[]
[null,"** Alternative - you may send an organization chart as an email attachment."]
[]
[]
[]
[null,"WORKING CONDITIONS AND PHYSICAL REQUIREMENTS:"]
[]
[null,"List any hazardous conditions or physical demands required by this position:             (type text below)"]
[]
[]
[null,"OVERSIGHT AND DIRECTION:"]
[]
[null,"Choose the statement that best captures the degree of independence under which this position operates:"]
[null," - click box for dropdown arrow -"]
[]
[null,"MINIMUM QUALIFICATIONS REQUIRED TO PERFORM THE JOB:"]
[]
[null,"Education:"," - click box for dropdown arrow -"]
[null,"Experience:"," - click box for dropdown arrow -"]
[null,"Degree Required: (Knowledge)"]
[null,"Experience/Skills Required:                               (Ability)      "]
[null,"Supplemental Qualification Required: (Licenses, Certifications, Registrations)"]

{"sheet":"MEMO","index":3,"n_rows":436,"n_cols":11,"rows_kept":436,"cut":false,"hidden":false,"merged":[[13,5,14,5],[46,0,46,3],[37,0,37,3],[36,0,36,3],[35,0,35,3],[26,4,26,6],[27,5,27,6],[28,5,28,6],[43,0,43,2],[44,0,44,2],[45,0,45,2],[40,0,41,2],[40,3,41,3],[40,6,41,6],[48,4,48,5],[50,4,50,5],[52,4,52,5],[40,10,41,10],[4,4,4,8],[33,0,33,8],[40,9,41,9],[42,0,42,2],[40,4,41,4],[40,5,41,5],[40,7,41,7],[40,8,41,8],[6,4,6,5],[8,4,8,5],[20,4,20,5],[13,4,14,4]]}
[null,null,null,null,null,null,null," "]
[null,null,null,null,null,null,null," "]
[null,null,null,null,null,null,null," "]
[null,null,null,null,null,null,null," "]
[null,null,null,null,"Form Date 11/13/2018"]
[]
[null,null,null,null,"** TO BE COMPLETED BY COMPENSATION **"]
[]
[null,null,null,null,"POSITION MEMO"]
[]
[null,null,null,null,"Position #:"]
[null,null,null,null,"Family:"]
[null,null,null,null,"Sub Family:"]
[null,null,null,null,"Career Stream and Level:"]
[]
[null,null,null,null,"MRR:"]
[null,null,null,null,"Zone 1:"]
[null,null,null,null,"Hiring Range                   (MRR min - max Zone 2):"]
[null,null,null,null,"Approved Working Title:"]
[]
[null,null,null,null,"Internal Office Use Only:"]
[null,null,null,null,"Eclass:"]
[null,null,null,null,"Pclass:"]
[null,null,null,null,"Job code:"]
[null,null,null,null,"Email date:"]
[]
[null,null,null,null,"Executive Officer Approval"]
[null,null,null,null,"Executive Officer Name:"]
[null,null,null,null,"Date Approved:"]
[]
[]
[]
[]
["For Reporting Purposes"]
[]
["Type of Position:",null,null,null,{"$f":"VLOOKUP('Approval and Funding'!K31,Sheet1!A83:A86,1,FALSE)","v":"- click box -"}]
["Limited Term End Date: ",null,null,null,{"$f":"'Approval and Funding'!K32","v":"00:00:00"}]
["Limited Term Length:",null,null,null,{"$f":"'Approval and Funding'!K33","v":"00:00:00"}]
[]
[]
["Labor Distribution Lines",null,null,"Fund","Organization","Program *","Activity (optional)","Funding Source *","Amount","Percentage","Primary?"]
[]
["Distribution 1",null,null,{"$f":"'Approval and Funding'!E42","v":0},{"$f":"'Approval and Funding'!F42","v":0},{"$f":"'Approval and Funding'!H42","v":0},{"$f":"'Approval and Funding'!I42","v":0},{"$f":"'Approval and Funding'!J42","v":" - Click Box"},{"$f":"'Approval and Funding'!K42","v":0},{"$f":"'Approval and Funding'!L42","v":0},"X"]
["Distribution 2",null,null,{"$f":"'Approval and Funding'!E43","v":0},{"$f":"'Approval and Funding'!F43","v":0},{"$f":"'Approval and Funding'!H43","v":0},{"$f":"'Approval and Funding'!I43","v":0},{"$f":"'Approval and Funding'!J43","v":" - Click Box"},{"$f":"'Approval and Funding'!K43","v":0},{"$f":"'Approval and Funding'!L43","v":0}]
["Distribution 3",null,null,{"$f":"'Approval and Funding'!E44","v":0},{"$f":"'Approval and Funding'!F44","v":0},{"$f":"'Approval and Funding'!H44","v":0},{"$f":"'Approval and Funding'!I44","v":0},{"$f":"'Approval and Funding'!J44","v":" - Click Box"},{"$f":"'Approval and Funding'!K44","v":0},{"$f":"'Approval and Funding'!L44","v":0}]
["Distribution 4",null,null,{"$f":"'Approval and Funding'!E45","v":0},{"$f":"'Approval and Funding'!F45","v":0},{"$f":"'Approval and Funding'!H45","v":0},{"$f":"'Approval and Funding'!I45","v":0},{"$f":"'Approval and Funding'!J45","v":" - Click Box"},{"$f":"'Approval and Funding'!K45","v":0},{"$f":"'Approval and Funding'!L45","v":0}]
["* Program Code should be 5-digits",null,null,null,null,null,null,"TOTAL",{"$f":"SUM(I43:I46)","v":0},{"$f":"SUM(J43:J46)","v":0}]
[]
[null,null,null,"X","New Position"]
[]
[null,null,null,null,"Replacement"]
[]
[null,null,null,null,"Repurpose"]
[]
[]
[]
[]
[]
[]
[]
[]
[]
[]
[]
[]
[]
[]
[]
[]
[]
[]
[]
[]
[]
[]
[]
[]
[]
[]
[]
[]
[]
[]
[]
[]
[]
[]
[]
[]
[]
[]
[]
[]
[]
[]
[]
[]
[]
[]
[]
[]
[]
[]
[]
[]
[]
[]
[]
[]
[]
[]
[]
[]
[]
[]
[]
[]
[]
[]
[]
[]
[]
[]
[]
[]
[]
[]
[]
[]
[]
[]
[]
[]
[]
[]
[]
[]
[]
[]
[]
[]
[]
[]
[]
[]
[]
[]
[]
[]
[]
[]
[]
[]
[]
[]
[]
[]
[]
[]
[]
[]
[]
[]
[]
[]
[]
[]
[]
[]
[]
[]
[]
[]
[]
[]
[]
[]
[]
[]
[]
[]
[]
[]
[]
[]
[]
[]
[]
[]
[]
[]
[]
[]
[]
[]
[]
[]
[]
[]
[]
[]
[]
[]
[]
[]
[]
[]
[]
[]
[]
[]
[]
[]
[]
[]
[]
[]
[]
[]
[]
[]
[]
[]
[]
[]
[]
[]
[]
[]
[]
[]
[]
[]
[]
[]
[]
[]
[]
[]
[]
[]
[]
[]
[]
[]
[]
[]
[]
[]
[]
[]
[]
[]
[]
[]
[]
[]
[]
[]
[]
[]
[]
[]
[]
[]
[]
[]
[]
[]
[]
[]
[]
[]
[]
[]
[]
[]
[]
[]
[]
[]
[]
[]
[]
[]
[]
[]
[]
[]
[]
[]
[]
[]
[]
[]
[]
[]
[]
[]
[]
[]
[]
[]
[]
[]
[]
[]
[]
[]
[]
[]
[]
[]
[]
[]
[]
[]
[]
[]
[]
[]
[]
[]
[]
[]
[]
[]
[]
[]
[]
[]
[]
[]
[]
[]
[]
[]
[]
[]
[]
[]
[]
[]
[]
[]
[]
[]
[]
[]
[]
[]
[]
[]
[]
[]
[]
[]
[]
[]
[]
[]
[]
[]
[]
[]
[]
[]
[]
[]
[]
[]
[]
[]
[]
[]
[]
[]
[]
[]
[]
[]
[]
[]
[]
[]
[]
[]
[]
[]
[]
[]
[]
[]
[]
[]
[]
[]
[]
[]
[]
{"$rows_left_out":37}
{"sheet":"Sheet1","index":4,"n_rows":98,"n_cols":5,"rows_kept":98,"cut":false,"hidden":true,"merged":[]}
["problem_solving2",null,"funding_source",null,"*For a new position, be sure to fill out the additional Position Justification Form"]
[" - click box for dropdown arrow -",null," - Click Box"]
[" - Problems have set solutions clearly defined by policy, guidelines and/or supervisor.",null," - OPB"]
[" - Problems are generally operational which require interpretation of information gathered through research and review of set policies, guidelines, precedence, and supervisor.",null," - AUX"]
[" - Problems require research and gathering facts from various sources; solutions require specialized knowledge and the ability to conceptualize various possible solutions within a given framework.",null," - AOV"]
[" - Problems require conceptual and abstract analysis and are more strategic than operational; solutions may require unconventional and multiple approaches.",null," - ONE"]
[null,null," - END"]
["policy_development",null," - EXP"]
[" - click box for dropdown arrow -",null," - REV"]
["  - Interprets and executes policy and procedures only.",null," - G&C"]
["  - Recommends changes to operating policies and procedures for own unit.",null," - RCH"]
["  - Establishes operating policies and procedures for own work unit and interprets, executes, and recommends changes to department policy.",null," - F&A"]
["  - Establishes operating policies and procedures for own department and interprets, executes and recommends changes to function policy.",null," - SAPC"]
["  - Establishes organizational policy for function and interprets, executes, and recommends changes to university wide policy.",null," - OTH"]
[]
["decisions_made"]
[" - click box for dropdown arrow -"]
["  - Decisions made and actions taken typically affect only this position."]
["  - Decisions made and actions taken typically affect a small group of jobs in the immediate area."]
["  - Decisions made and actions taken typically affect the entire work unit."]
["  - Decisions made and actions taken typically affect the department."]
["  - Decisions made and actions taken typically affect the function of college/school."]
["  - Decisions made and actions taken typically affect the University."]
[]
["reporting_relationships"]
[" - click box for dropdown arrow -"]
[" - Has no authority or responsibility for the supervision of staff."]
[" - Has authority or responsibility for the supervision of student workers only."]
[" - Has authority or responsibility over staff employees on a regular basis but is not a direct supervisor. May assign, schedule and monitor the work of staff."]
[" - Has authority or responsibility over three or more full-time staff. Responsible for hiring, terminating, appraising performance or strongly recommending such personnel actions."]
[" - Has authority or responsibility of a department or program, and typically supervises personnel who have professional responsibility."]
[" - Has authority or responsibility of a function and typically supervises management personnel and indirectly supervises subordinate staff under this position’s line of authority."]
[]
["oversight_direction"]
[" - click box for dropdown arrow -"]
[" - Receives clear and specific instructions and/or follows standardized instructions or procedures for most tasks with or without ongoing supervision. Work is checked for accuracy, adequacy and adherence to instructions. Employee consults with supervisor on matters not covered in the original instructions or by guidelines."]
[" - Receives moderate to limited supervision working from objectives set by supervisor. Employee organizes and carries out most assignments in accordance with standard practices, instructions or previous training. Employee handles some unusual situations independently."]
[" - Receives general direction working from established policies and objectives. Employee plans and carries out assignments and resolves most conflicts that arise. Completed work is checked only to determine feasibility and compatibility with other work, or effectiveness in meeting objectives of the unit."]
[" - Receives only broad administrative guidance. Assignments are in terms of setting objectives within strategic planning goals. Employee has responsibility for planning, designing and implementing programs, projects and studies and sets goals for a department, function, or college. Approval from higher supervision may be necessary only in terms of financial impact and availability of funds but little reference to detail is discussed with the supervisor."]
[]
["Education"]
[" - click box for dropdown arrow -"]
["Less than high school education"]
["High school diploma or GED"]
["One year certificate or training from college or technical school"]
["Associate’s degree or up to 3 years of college or technical school"]
["Bachelor’s degree (4 years)"]
["Master’s degree or Bachelor’s degree (5 years) or advanced certification beyond Bachelor’s"]
["Doctoral degree (Ph.D., J.D., Ed.D.)"]
[]
["Experience"]
[" - click box for dropdown arrow -"]
["None"]
["1 to 6 months"]
["6 to 12 months"]
["1 to 2 years"]
["3 to 4 years"]
["5 to 6 years"]
["7 or more years"]
[]
["Supervisor's Career Stream and Level",null,null,null,"Supervisor's Career Stream and Level"]
[" - click box for dropdown arrow -",null,"Supervisor's Career Stream and Level"]
["EIC1",null,null,null," - click box for dropdown arrow -"]
["EIC2",null," - click box for dropdown arrow -",null,"EIC1"]
["EIC3",null,"EIC2",null,"EIC2"]
["NIC1",null,"EIC3",null,"EIC3"]
["NIC2",null,"NIC1",null,"NIC1"]
["NIC3",null,"NIC2",null,"NIC2"]
["M1",null,"NIC3",null,"NIC3"]
["M2",null,"M1",null,"M1"]
["M3",null,"M2",null,"M2"]
["M4",null,"M3",null,"M3"]
["M5",null,"M4",null,"M4"]
[null,null,"M5",null,"M5"]
["E-class",null,"Faculty",null,"Faculty"]
[" - click box for dropdown arrow -"]
["S1 - FT Exempt"]
["S2 - PT Exempt"]
["S3 - FT Non-exempt Hourly"]
["S4 - PT Non-exempt Hourly"]
["S5 - FT Non-exempt Salaried"]
[]
["Position Type"]
["- click box -"]
["Permanent"]
["Limited Term"]
[]
[" - click box for dropdown arrow -",null,"approval"]
[" Received approval during BWG (position approved as an add-on)",null,"- click box for dropdown arrow -"]
[" Received approval outside of BWG process from EXECUTIVE VICE-PRESIDENT",null,"- Received approval outside of Budget Working Group from EXECUTIVE OFFICER"]
[null,null,"- No approval required - REPLACEMENT POSITION"]
[" Received approval outside of BWG process from PROVOST OFFICE",null,"- Received Approval - GRANT/RESTRICTED FUNDED"]
[null,null,"Correct approval type list 3/11/11"]
[null,null,"- click box for dropdown arrow -"]
[null,null,"- Received approval outside of Budget Working Group from EXECUTIVE OFFICER"]
[null,null,"- Received approval during Budget Working Group - Position approved as an add-on"]
[null,null,"- No approval required - REPLACEMENT POSITION"]
[null,null,"- Received Approval - GRANT/RESTRICTED FUNDED"]

{"sheet":"Sheet2","index":5,"n_rows":0,"n_cols":0,"rows_kept":0,"cut":false,"hidden":true,"merged":[]}